{"text_format":"1","workbook":"xlsx","n_sheets":10,"sheets":["Table of Contents","Instructions","Data","Overall Charts A","Overall Charts B","Breakdown Charts A","Breakdown Charts B","Breakdown Charts C","Breakdown Charts D","Data.Calculations"],"not_rendered":{"charts":39,"images":6,"macros":1,"external_links":0,"defined_names":1,"comments":0,"pivot_tables":0},"unopened":[],"bounds":{"document_bytes":16777216,"sheet_cells":100000,"rows_first":2000,"rows_last":500,"rows_between":2000,"halvings":0,"cell_chars":16384,"cell_head_chars":4096},"cells_cut":0,"cells_raw":0,"read":"whole","date_system":"1900"}

{"sheet":"Table of Contents","index":0,"n_rows":18,"n_cols":1,"rows_kept":18,"cut":false,"hidden":false,"merged":[]}
["Introduction"]
["The purpose of this Excel Workbook is to provide PEAs with a tool to analyze Post School Outcomes (PSO) data."]
["Table of Contents"]
["Tabs & Definitions"]
["Instructions Tab\nSteps for using the PEA PSO Data Analysis Template."]
["Data Tab\nSection of the workbook where PSO data is pasted. The Data Tab is the only tab in this workbook that is recommended to be modified."]
["Overall Charts\nCharts displaying the following PSO data for all respondents:\n• Overall Charts A: Indicator 14 measurements, categories of engagement, and response rate/representativeness.  \n• Overall Charts B: Engagement rates by demographic categories."]
["Breakdown Charts\nCharts displaying the engagement rates for each demographic category of respondents. Total number of respondents for each category is displayed in the title of each chart.\n• Breakdown Charts A: Gender and Exit Data\n• Breakdown Charts B: Race/ethnicity\n• Breakdown Charts C: Disability categories reported for Indicator 14 \n• Breakdown Charts D: All disability categories"]
["Please note, this template is designed to work with Microsoft Excel files only. Similar programs, like Apple Numbers, may impact data analysis accuracy.\n\nData analysis accuracy could also be affected if any adjustment occurs in the Excel Workbook other than pasting data into the Data tab."]
["Post School Outcomes Resources"]
{"$rows_left_out":9}
{"sheet":"Instructions","index":1,"n_rows":129,"n_cols":1,"rows_kept":129,"cut":false,"hidden":false,"merged":[]}
["INSTRUCTIONS"]
["Step 1\nWithin the PSO Application, hover your cursor over \"Reports\" and select \"PSO Data Viewer.\" "]
[]
[]
[]
[]
[]
[]
[]
[]
{"$rows_left_out":120}
{"sheet":"Data","index":2,"n_rows":0,"n_cols":0,"rows_kept":0,"cut":false,"hidden":false,"merged":[]}

{"sheet":"Overall Charts A","index":3,"n_rows":93,"n_cols":10,"rows_kept":93,"cut":false,"hidden":false,"merged":[]}
["Overall Charts A: Indicator 14 Measurements, Categories of Engagement, and Response Rate/Representativeness"]
[]
[]
[]
[]
[]
[]
[]
[]
[]
{"$rows_left_out":84}
{"sheet":"Overall Charts B","index":4,"n_rows":1,"n_cols":7,"rows_kept":1,"cut":false,"hidden":false,"merged":[]}
[null,null,null,null,null,null,"Overall Charts B: Engagement Rates by Demographics Categories"]

{"sheet":"Breakdown Charts A","index":5,"n_rows":1,"n_cols":7,"rows_kept":1,"cut":false,"hidden":false,"merged":[]}
[null,null,null,null,null,null,"Breakdown Charts A: Gender and Exit Data"]

{"sheet":"Breakdown Charts B","index":6,"n_rows":1,"n_cols":7,"rows_kept":1,"cut":false,"hidden":false,"merged":[]}
[null,null,null,null,null,null,"Breakdown Charts B: Race/Ethnicity"]

{"sheet":"Breakdown Charts C","index":7,"n_rows":1,"n_cols":7,"rows_kept":1,"cut":false,"hidden":false,"merged":[]}
[null,null,null,null,null,null,"Breakdown Charts C: Disability Categories Reported for Indicator 14"]

{"sheet":"Breakdown Charts D","index":8,"n_rows":1,"n_cols":7,"rows_kept":1,"cut":false,"hidden":false,"merged":[]}
[null,null,null,null,null,null,"Breakdown Charts D: All Disability Categories"]

{"sheet":"Data.Calculations","index":9,"n_rows":106,"n_cols":34,"rows_kept":106,"cut":false,"hidden":true,"merged":[]}
["Key",null,"n",null,"%",null,"n","% (N/A)","%",null,"n","% (N/A)","%",null,"n","% (N/A)","%",null,"n","% (N/A)","%",null,"n","% (N/A)","%",null,"Total","Engaged","Not Engaged","Engaged %","Not Engaged %","Female","American Indian or Alaskan Native","Autism"]
["Required","Engaged",{"$f":"COUNTIFS(Data!G:G,A2,Data!AO:AO,A6,Data!AU:AU,A4)","v":0},null,null,{"$f":"A13&\" (\"&G2&\")\"","v":"Female (0)"},{"$f":"COUNTIFS(Data!G:G,A2,Data!AO:AO,A6,Data!AD:AD,A13,Data!AU:AU,A4)+COUNTIFS(Data!G:G,A2,Data!AO:AO,A6,Data!AD:AD,A13,Data!AU:AU,A12)","v":0},{"$f":"IF(G2/$C$4=0,#N/A,G2/$C$4)","v":{"$error":"#DIV/0!"}},{"$f":"IFERROR(G2/C4,\"0\")","v":"0"},{"$f":"\"Aged Out \"&\" (\"&K2&\")\"","v":"Aged Out  (0)"},{"$f":"COUNTIFS(Data!G:G,A2,Data!AO:AO,A6,Data!AK:AK,A19,Data!AU:AU,A4)+COUNTIFS(Data!G:G,A2,Data!AO:AO,A6,Data!AK:AK,A19,Data!AU:AU,A12)","v":0},{"$f":"IFERROR(K2/$C$5,#N/A)","v":{"$error":"#N/A"}},{"$f":"IFERROR(K2/$C$5,#N/A)","v":{"$error":"#N/A"}},{"$f":"A15&\" (\"&O2&\")\"","v":"All Other Disabilities (0)"},{"$f":"COUNTIFS(Data!G:G,A2,Data!AO:AO,A6,Data!AA:AA,A15,Data!AU:AU,A4)+COUNTIFS(Data!G:G,A2,Data!AO:AO,A6,Data!AA:AA,A15,Data!AU:AU,A12)","v":0},{"$f":"IFERROR(O2/$C$5,#N/A)","v":{"$error":"#N/A"}},{"$f":"IFERROR(O2/$C$5,#N/A)","v":{"$error":"#N/A"}},{"$f":"A22&\" (\"&S2&\")\"","v":"American Indian or Alaskan Native (0)"},{"$f":"COUNTIFS(Data!G:G,A2,Data!AO:AO,A6,Data!AF:AF,A22,Data!AU:AU,A4)+COUNTIFS(Data!G:G,A2,Data!AO:AO,A6,Data!AF:AF,A22,Data!AU:AU,A12)","v":0},{"$f":"IFERROR(S2/$C$5,#N/A)","v":{"$error":"#N/A"}},{"$f":"IFERROR(S2/$C$5,#N/A)","v":{"$error":"#N/A"}},{"$f":"A29&\" (\"&W2&\")\"","v":"Autism (0)"},{"$f":"COUNTIFS(Data!G:G,A2,Data!AO:AO,A6,Data!Y:Y,A29,Data!AU:AU,A4)+COUNTIFS(Data!G:G,A2,Data!AO:AO,A6,Data!Y:Y,A29,Data!AU:AU,A12)","v":0},{"$f":"IFERROR(W2/$C$5,#N/A)","v":{"$error":"#N/A"}},{"$f":"IFERROR(W2/$C$5,#N/A)","v":{"$error":"#N/A"}},{"$f":"A29&\" (\"&AA2&\")\"","v":"Autism (0)"},{"$f":"COUNTIFS(Data!$Y:$Y,A29,Data!$AU:$AU,\"C\")+COUNTIFS(Data!$Y:$Y,A29,Data!$AU:$AU,\"not engaged\")","v":0},{"$f":"IFERROR(COUNTIFS(Data!$AU:$AU,\"C\",Data!$Y:$Y,A29),\"0.0%\")","v":0},{"$f":"IFERROR(COUNTIFS(Data!$AU:$AU,\"Not Engaged\",Data!$Y:$Y,A29),\"0.0%\")","v":0},{"$f":"IFERROR(AB2/AA2,#N/A)","v":{"$error":"#N/A"}},{"$f":"IFERROR(AC2/AA2,#N/A)","v":{"$error":"#N/A"}},{"$f":"$A$78&\"\" &\" (\"&G5&\")\"","v":"Higher Education (0)"},{"$f":"$A$78&\"\" &\" (\"&S10&\")\"","v":"Higher Education (0)"},{"$f":"$A$78&\"\" &\" (\"&W18&\")\"","v":"Higher Education (0)"}]
["Not Required","Not Engaged",{"$f":"COUNTIFS(Data!G:G,A2,Data!AO:AO,A6,Data!AU:AU,A12)","v":0},null,null,{"$f":"A14&\" (\"&G3&\")\"","v":"Male (0)"},{"$f":"COUNTIFS(Data!G:G,A2,Data!AO:AO,A6,Data!AD:AD,A14,Data!AU:AU,A4)+COUNTIFS(Data!G:G,A2,Data!AO:AO,A6,Data!AD:AD,A14,Data!AU:AU,A12)","v":0},{"$f":"IF(G3/$C$4=0,#N/A,G3/$C$4)","v":{"$error":"#DIV/0!"}},{"$f":"IFERROR(G3/C4,\"0\")","v":"0"},{"$f":"A20&\" (\"&K3&\")\"","v":"Dropped Out (0)"},{"$f":"COUNTIFS(Data!G:G,A2,Data!AO:AO,A6,Data!AK:AK,A20,Data!AU:AU,A4)+COUNTIFS(Data!G:G,A2,Data!AO:AO,A6,Data!AK:AK,A20,Data!AU:AU,A12)","v":0},{"$f":"IFERROR(K3/$C$5,#N/A)","v":{"$error":"#N/A"}},{"$f":"IFERROR(K3/$C$5,#N/A)","v":{"$error":"#N/A"}},{"$f":"A16&\" (\"&O3&\")\"","v":"Emotional Disturbance (0)"},{"$f":"COUNTIFS(Data!G:G,A2,Data!AO:AO,A6,Data!AA:AA,A16,Data!AU:AU,A4)+COUNTIFS(Data!G:G,A2,Data!AO:AO,A6,Data!AA:AA,A16,Data!AU:AU,A12)","v":0},{"$f":"IFERROR(O3/$C$5,#N/A)","v":{"$error":"#N/A"}},{"$f":"IFERROR(O3/$C$5,#N/A)","v":{"$error":"#N/A"}},"Asian (0)",{"$f":"COUNTIFS(Data!G:G,A2,Data!AO:AO,A6,Data!AF:AF,A23,Data!AU:AU,A4)+COUNTIFS(Data!G:G,A2,Data!AO:AO,A6,Data!AF:AF,A23,Data!AU:AU,A12)","v":0},{"$f":"IFERROR(S3/$C$5,#N/A)","v":{"$error":"#N/A"}},{"$f":"IFERROR(S3/$C$5,#N/A)","v":{"$error":"#N/A"}},"Emotional Disability (0)",{"$f":"COUNTIFS(Data!G:G,A2,Data!AO:AO,A6,Data!Y:Y,A30,Data!AU:AU,A4)+COUNTIFS(Data!G:G,A2,Data!AO:AO,A6,Data!Y:Y,A30,Data!AU:AU,A12)","v":0},{"$f":"IFERROR(W3/$C$5,#N/A)","v":{"$error":"#N/A"}},{"$f":"IFERROR(W3/$C$5,#N/A)","v":{"$error":"#N/A"}},"Emotional Disability (0)",{"$f":"COUNTIFS(Data!$Y:$Y,A30,Data!$AU:$AU,\"C\")+COUNTIFS(Data!$Y:$Y,A30,Data!$AU:$AU,\"not engaged\")","v":0},{"$f":"IFERROR(COUNTIFS(Data!$AU:$AU,\"C\",Data!$Y:$Y,A30),\"0.0%\")","v":0},{"$f":"IFERROR(COUNTIFS(Data!$AU:$AU,\"Not Engaged\",Data!$Y:$Y,A30),\"0.0%\")","v":0},{"$f":"IFERROR(AB3/AA3,#N/A)","v":{"$error":"#N/A"}},{"$f":"IFERROR(AC3/AA3,#N/A)","v":{"$error":"#N/A"}},{"$f":"$B$8&\"\" &\" (\"&G6&\")\"","v":"Competitive Employment (0)"},{"$f":"$B$8&\"\" &\" (\"&S11&\")\"","v":"Competitive Employment (0)"},{"$f":"$B$8&\"\" &\" (\"&W19&\")\"","v":"Competitive Employment (0)"}]
["C","Eligible",{"$f":"COUNTIFS(Data!G:G,A2,Data!AO:AO,A6)","v":0},null,null,null,null,null,null,{"$f":"A21&\" (\"&K4&\")\"","v":"Graduated (0)"},{"$f":"COUNTIFS(Data!G:G,A2,Data!AO:AO,A6,Data!AK:AK,A21,Data!AU:AU,A4)+COUNTIFS(Data!G:G,A2,Data!AO:AO,A6,Data!AK:AK,A21,Data!AU:AU,A12)","v":0},{"$error":"#N/A"},{"$error":"#N/A"},{"$f":"A17&\" (\"&O4&\")\"","v":"Intellectual Disability (0)"},{"$f":"COUNTIFS(Data!G:G,A2,Data!AO:AO,A6,Data!AA:AA,A17,Data!AU:AU,A4)+COUNTIFS(Data!G:G,A2,Data!AO:AO,A6,Data!AA:AA,A17,Data!AU:AU,A12)","v":0},{"$error":"#N/A"},{"$error":"#N/A"},"Black or African American (0)",{"$f":"COUNTIFS(Data!G:G,A2,Data!AO:AO,A6,Data!AF:AF,A24,Data!AU:AU,A4)+COUNTIFS(Data!G:G,A2,Data!AO:AO,A6,Data!AF:AF,A24,Data!AU:AU,A12)","v":0},{"$error":"#N/A"},{"$error":"#N/A"},"Emotional Disability (separate facility, private school) (0)",{"$f":"COUNTIFS(Data!G:G,A2,Data!AO:AO,A6,Data!Y:Y,A31,Data!AU:AU,A4)+COUNTIFS(Data!G:G,A2,Data!AO:AO,A6,Data!Y:Y,A31,Data!AU:AU,A12)","v":0},{"$error":"#N/A"},{"$error":"#N/A"},"Emotional Disability (separate facility, private school) (0)",{"$f":"COUNTIFS(Data!$Y:$Y,A31,Data!$AU:$AU,\"C\")+COUNTIFS(Data!$Y:$Y,A31,Data!$AU:$AU,\"not engaged\")","v":0},{"$f":"IFERROR(COUNTIFS(Data!$AU:$AU,\"C\",Data!$Y:$Y,A31),\"0.0%\")","v":0},{"$f":"IFERROR(COUNTIFS(Data!$AU:$AU,\"Not Engaged\",Data!$Y:$Y,A31),\"0.0%\")","v":0},{"$error":"#N/A"},{"$error":"#N/A"},{"$f":"$A$80&\"\" &\" (\"&G7&\")\"","v":"Other Postsecondary Education or Training (0)"},{"$f":"$A$80&\"\" &\" (\"&S12&\")\"","v":"Other Postsecondary Education or Training (0)"},{"$f":"$A$80&\"\" &\" (\"&W20&\")\"","v":"Other Postsecondary Education or Training (0)"}]
["TRUE","Respondents",{"$f":"C2+C3","v":0},null,{"$f":"IFERROR(C5/C4,#N/A)","v":{"$error":"#N/A"}},{"$f":"$A$13&\" (\"&G5&\")\"","v":"Female (0)"},{"$f":"IFERROR(COUNTIFS(Data!G2:G1000000,A2,Data!AO2:AO1000000,A6,Data!AT2:AT1000000,A8,Data!AD2:AD1000000,A13),\"0\")","v":0},{"$f":"IF(G5/$G$2=0,#N/A,G5/$G$2)","v":{"$error":"#DIV/0!"}},{"$f":"IFERROR(G5/G2,\"0\")","v":"0"},null,null,{"$error":"#N/A"},{"$error":"#N/A"},{"$f":"A18&\" (\"&O5&\")\"","v":"Specific Learning Disability (0)"},{"$f":"COUNTIFS(Data!G:G,A2,Data!AO:AO,A6,Data!AA:AA,A18,Data!AU:AU,A4)+COUNTIFS(Data!G:G,A2,Data!AO:AO,A6,Data!AA:AA,A18,Data!AU:AU,A12)","v":0},{"$error":"#N/A"},{"$error":"#N/A"},"Hispanic or Latino (0)",{"$f":"COUNTIFS(Data!G:G,A2,Data!AO:AO,A6,Data!AF:AF,A25,Data!AU:AU,A4)+COUNTIFS(Data!G:G,A2,Data!AO:AO,A6,Data!AF:AF,A25,Data!AU:AU,A12)","v":0},{"$error":"#N/A"},{"$error":"#N/A"},"Hearing Impairment (0)",{"$f":"COUNTIFS(Data!G:G,A2,Data!AO:AO,A6,Data!Y:Y,A32,Data!AU:AU,A4)+COUNTIFS(Data!G:G,A2,Data!AO:AO,A6,Data!Y:Y,A32,Data!AU:AU,A12)","v":0},{"$error":"#N/A"},{"$error":"#N/A"},"Hearing Impairment (0)",{"$f":"COUNTIFS(Data!$Y:$Y,A32,Data!$AU:$AU,\"C\")+COUNTIFS(Data!$Y:$Y,A32,Data!$AU:$AU,\"not engaged\")","v":0},{"$f":"IFERROR(COUNTIFS(Data!$AU:$AU,\"C\",Data!$Y:$Y,A32),\"0.0%\")","v":0},{"$f":"IFERROR(COUNTIFS(Data!$AU:$AU,\"Not Engaged\",Data!$Y:$Y,A32),\"0.0%\")","v":0},{"$error":"#N/A"},{"$error":"#N/A"},{"$f":"$A$81&\"\" &\" (\"&G8&\")\"","v":"Other Employment (0)"},{"$f":"$A$81&\"\" &\" (\"&S13&\")\"","v":"Other Employment (0)"},{"$f":"$A$81&\"\" &\" (\"&W21&\")\"","v":"Other Employment (0)"}]
[false,null,null,null,null,{"$f":"$A$13&\" (\"&G6&\")\"","v":"Female (0)"},{"$f":"IFERROR(COUNTIFS(Data!G2:G1000000,A2,Data!AO2:AO1000000,A6,Data!AT2:AT1000000,A9,Data!AD2:AD1000000,A13),\"0\")","v":0},{"$f":"IF(G6/$G$2=0,#N/A,G6/$G$2)","v":{"$error":"#DIV/0!"}},{"$f":"IFERROR(G6/G2,\"0\")","v":"0"},{"$f":"\"Aged Out \"&\" (\"&K6&\")\"","v":"Aged Out  (0)"},{"$f":"IFERROR(COUNTIFS(Data!G2:G1000000,A2,Data!AO2:AO1000000,A6,Data!AT2:AT1000000,A8,Data!AK2:AK1000000,A19),\"0\")","v":0},{"$error":"#N/A"},{"$error":"#N/A"},null,null,{"$error":"#N/A"},{"$error":"#N/A"},"Multi-Racial (0)",{"$f":"COUNTIFS(Data!G:G,A2,Data!AO:AO,A6,Data!AF:AF,A26,Data!AU:AU,A4)+COUNTIFS(Data!G:G,A2,Data!AO:AO,A6,Data!AF:AF,A26,Data!AU:AU,A12)","v":0},{"$error":"#N/A"},{"$error":"#N/A"},"Mild Intellectual Disability (0)",{"$f":"COUNTIFS(Data!G:G,A2,Data!AO:AO,A6,Data!Y:Y,A33,Data!AU:AU,A4)+COUNTIFS(Data!G:G,A2,Data!AO:AO,A6,Data!Y:Y,A33,Data!AU:AU,A12)","v":0},{"$error":"#N/A"},{"$error":"#N/A"},"Mild Intellectual Disability (0)",{"$f":"COUNTIFS(Data!$Y:$Y,A33,Data!$AU:$AU,\"C\")+COUNTIFS(Data!$Y:$Y,A33,Data!$AU:$AU,\"not engaged\")","v":0},{"$f":"IFERROR(COUNTIFS(Data!$AU:$AU,\"C\",Data!$Y:$Y,A33),\"0.0%\")","v":0},{"$f":"IFERROR(COUNTIFS(Data!$AU:$AU,\"Not Engaged\",Data!$Y:$Y,A33),\"0.0%\")","v":0},{"$error":"#N/A"},{"$error":"#N/A"},{"$f":"$B$11&\"\" &\" (\"&G9&\")\"","v":"Not Engaged (0)"},{"$f":"$B$11&\"\" &\" (\"&S14&\")\"","v":"Not Engaged (0)"},{"$f":"$B$11&\"\" &\" (\"&W22&\")\"","v":"Not Engaged (0)"}]
["Unknown",{"$f":"A8","v":"Enrolled in Higher Education"},{"$f":"COUNTIFS(Data!G:G,A2,Data!AO:AO,A6,Data!AT:AT,A8)","v":0},null,{"$f":"IFERROR(C7/$C$5,#N/A)","v":{"$error":"#N/A"}},"Female (0)",{"$f":"IFERROR(COUNTIFS(Data!G2:G1000000,A2,Data!AO2:AO1000000,A6,Data!AT2:AT1000000,A10,Data!AD2:AD1000000,A13),\"0\")","v":0},{"$error":"#DIV/0!"},{"$f":"IFERROR(G7/G2,\"0\")","v":"0"},{"$f":"\"Aged Out \"&\" (\"&K7&\")\"","v":"Aged Out  (0)"},{"$f":"IFERROR(COUNTIFS(Data!G2:G1000000,A2,Data!AO2:AO1000000,A6,Data!AT2:AT1000000,A9,Data!AK2:AK1000000,A19),\"0\")","v":0},{"$error":"#N/A"},{"$error":"#N/A"},{"$f":"$A$15&\" (\"&O7&\")\"","v":"All Other Disabilities (0)"},{"$f":"IFERROR(COUNTIFS(Data!G2:G1000000,A2,Data!AO2:AO1000000,A6,Data!AT2:AT1000000,A8,Data!AA2:AA1000000,A15),\"0\")","v":0},{"$error":"#N/A"},{"$error":"#N/A"},"Native Hawaiian or Other Pacific Islander (0)",{"$f":"COUNTIFS(Data!G:G,A2,Data!AO:AO,A6,Data!AF:AF,A27,Data!AU:AU,A4)+COUNTIFS(Data!G:G,A2,Data!AO:AO,A6,Data!AF:AF,A27,Data!AU:AU,A12)","v":0},{"$error":"#N/A"},{"$error":"#N/A"},"Moderate Intellectual Disability (0)",{"$f":"COUNTIFS(Data!G:G,A2,Data!AO:AO,A6,Data!Y:Y,A34,Data!AU:AU,A4)+COUNTIFS(Data!G:G,A2,Data!AO:AO,A6,Data!Y:Y,A34,Data!AU:AU,A12)","v":0},{"$error":"#N/A"},{"$error":"#N/A"},"Moderate Intellectual Disability (0)",{"$f":"COUNTIFS(Data!$Y:$Y,A34,Data!$AU:$AU,\"C\")+COUNTIFS(Data!$Y:$Y,A34,Data!$AU:$AU,\"not engaged\")","v":0},{"$f":"IFERROR(COUNTIFS(Data!$AU:$AU,\"C\",Data!$Y:$Y,A34),\"0.0%\")","v":0},{"$f":"IFERROR(COUNTIFS(Data!$AU:$AU,\"Not Engaged\",Data!$Y:$Y,A34),\"0.0%\")","v":0},{"$error":"#N/A"},{"$error":"#N/A"},"Male","Asian","Emotional Disability"]
["Enrolled in Higher Education",{"$f":"A9","v":"Competitive Employment"},{"$f":"COUNTIFS(Data!G:G,A2,Data!AO:AO,A6,Data!AT:AT,A9)","v":0},null,{"$f":"IFERROR(C8/$C$5,#N/A)","v":{"$error":"#N/A"}},"Female (0)",{"$f":"IFERROR(COUNTIFS(Data!G2:G1000000,A2,Data!AO2:AO1000000,A6,Data!AT2:AT1000000,A11,Data!AD2:AD1000000,A13),\"0\")","v":0},{"$error":"#DIV/0!"},{"$f":"IFERROR(G8/G2,\"0\")","v":"0"},"Aged Out  (0)",{"$f":"IFERROR(COUNTIFS(Data!G2:G1000000,A2,Data!AO2:AO1000000,A6,Data!AT2:AT1000000,A10,Data!AK2:AK1000000,A19),\"0\")","v":0},{"$error":"#N/A"},{"$error":"#N/A"},{"$f":"$A$15&\" (\"&O8&\")\"","v":"All Other Disabilities (0)"},{"$f":"IFERROR(COUNTIFS(Data!G2:G1000000,A2,Data!AO2:AO1000000,A6,Data!AT2:AT1000000,A9,Data!AA2:AA1000000,A15),\"0\")","v":0},{"$error":"#N/A"},{"$error":"#N/A"},"White (0)",{"$f":"COUNTIFS(Data!G:G,A2,Data!AO:AO,A6,Data!AF:AF,A28,Data!AU:AU,A4)+COUNTIFS(Data!G:G,A2,Data!AO:AO,A6,Data!AF:AF,A28,Data!AU:AU,A12)","v":0},{"$error":"#N/A"},{"$error":"#N/A"},"Multiple Disabilities (0)",{"$f":"COUNTIFS(Data!G:G,A2,Data!AO:AO,A6,Data!Y:Y,A35,Data!AU:AU,A4)+COUNTIFS(Data!G:G,A2,Data!AO:AO,A6,Data!Y:Y,A35,Data!AU:AU,A12)","v":0},{"$error":"#N/A"},{"$error":"#N/A"},"Multiple Disabilities (0)",{"$f":"COUNTIFS(Data!$Y:$Y,A35,Data!$AU:$AU,\"C\")+COUNTIFS(Data!$Y:$Y,A35,Data!$AU:$AU,\"not engaged\")","v":0},{"$f":"IFERROR(COUNTIFS(Data!$AU:$AU,\"C\",Data!$Y:$Y,A35),\"0.0%\")","v":0},{"$f":"IFERROR(COUNTIFS(Data!$AU:$AU,\"Not Engaged\",Data!$Y:$Y,A35),\"0.0%\")","v":0},{"$error":"#N/A"},{"$error":"#N/A"},{"$f":"$A$78&\"\" &\" (\"&G11&\")\"","v":"Higher Education (0)"},{"$f":"$A$78&\"\" &\" (\"&S16&\")\"","v":"Higher Education (0)"},{"$f":"$A$78&\"\" &\" (\"&W24&\")\"","v":"Higher Education (0)"}]
["Competitive Employment",{"$f":"A10","v":"Enrolled In Other Postsecondary Education Or Training"},{"$f":"COUNTIFS(Data!G:G,A2,Data!AO:AO,A6,Data!AT:AT,A10)","v":0},null,{"$error":"#N/A"},"Female (0)",{"$f":"IFERROR(COUNTIFS(Data!G2:G1000000,A2,Data!AO2:AO1000000,A6,Data!AT2:AT1000000,A12,Data!AD2:AD1000000,A13),\"0\")","v":0},{"$error":"#DIV/0!"},{"$f":"IFERROR(G9/G2,\"0\")","v":"0"},"Aged Out  (0)",{"$f":"IFERROR(COUNTIFS(Data!G2:G1000000,A2,Data!AO2:AO1000000,A6,Data!AT2:AT1000000,A11,Data!AK2:AK1000000,A19),\"0\")","v":0},{"$error":"#N/A"},{"$error":"#N/A"},"All Other Disabilities (0)",{"$f":"IFERROR(COUNTIFS(Data!G2:G1000000,A2,Data!AO2:AO1000000,A6,Data!AT2:AT1000000,A10,Data!AA2:AA1000000,A15),\"0\")","v":0},{"$error":"#N/A"},{"$error":"#N/A"},null,null,{"$error":"#N/A"},{"$error":"#N/A"},"Multiple Disabilities - Severe Sensory Impairment (0)",{"$f":"COUNTIFS(Data!G:G,A2,Data!AO:AO,A6,Data!Y:Y,A36,Data!AU:AU,A4)+COUNTIFS(Data!G:G,A2,Data!AO:AO,A6,Data!Y:Y,A36,Data!AU:AU,A12)","v":0},{"$error":"#N/A"},{"$error":"#N/A"},"Multiple Disabilities - Severe Sensory Impairment (0)",{"$f":"COUNTIFS(Data!$Y:$Y,A36,Data!$AU:$AU,\"C\")+COUNTIFS(Data!$Y:$Y,A36,Data!$AU:$AU,\"not engaged\")","v":0},{"$f":"IFERROR(COUNTIFS(Data!$AU:$AU,\"C\",Data!$Y:$Y,A36),\"0.0%\")","v":0},{"$f":"IFERROR(COUNTIFS(Data!$AU:$AU,\"Not Engaged\",Data!$Y:$Y,A36),\"0.0%\")","v":0},{"$error":"#N/A"},{"$error":"#N/A"},{"$f":"$B$8&\"\" &\" (\"&G12&\")\"","v":"Competitive Employment (0)"},{"$f":"$B$8&\"\" &\" (\"&S17&\")\"","v":"Competitive Employment (0)"},{"$f":"$B$8&\"\" &\" (\"&W25&\")\"","v":"Competitive Employment (0)"}]
["Enrolled In Other Postsecondary Education Or Training",{"$f":"A11","v":"Some Other Employment"},{"$f":"COUNTIFS(Data!G:G,A2,Data!AO:AO,A6,Data!AT:AT,A11)","v":0},null,{"$error":"#N/A"},null,null,null,null,"Aged Out  (0)",{"$f":"IFERROR(COUNTIFS(Data!G2:G1000000,A2,Data!AO2:AO1000000,A6,Data!AT2:AT1000000,A12,Data!AK2:AK1000000,A19),\"0\")","v":0},{"$error":"#N/A"},{"$error":"#N/A"},"All Other Disabilities (0)",{"$f":"IFERROR(COUNTIFS(Data!G2:G1000000,A2,Data!AO2:AO1000000,A6,Data!AT2:AT1000000,A11,Data!AA2:AA1000000,A15),\"0\")","v":0},{"$error":"#N/A"},{"$error":"#N/A"},{"$f":"$A$22&\" (\"&S10&\")\"","v":"American Indian or Alaskan Native (0)"},{"$f":"IFERROR(COUNTIFS(Data!G2:G1000000,A2,Data!AO2:AO1000000,A6,Data!AT2:AT1000000,A8,Data!AF2:AF1000000,A22),\"0\")","v":0},{"$error":"#N/A"},{"$error":"#N/A"},"Orthopedic Impairment (0)",{"$f":"COUNTIFS(Data!G:G,A2,Data!AO:AO,A6,Data!Y:Y,A37,Data!AU:AU,A4)+COUNTIFS(Data!G:G,A2,Data!AO:AO,A6,Data!Y:Y,A37,Data!AU:AU,A12)","v":0},{"$error":"#N/A"},{"$error":"#N/A"},"Orthopedic Impairment (0)",{"$f":"COUNTIFS(Data!$Y:$Y,A37,Data!$AU:$AU,\"C\")+COUNTIFS(Data!$Y:$Y,A37,Data!$AU:$AU,\"not engaged\")","v":0},{"$f":"IFERROR(COUNTIFS(Data!$AU:$AU,\"C\",Data!$Y:$Y,A37),\"0.0%\")","v":0},{"$f":"IFERROR(COUNTIFS(Data!$AU:$AU,\"Not Engaged\",Data!$Y:$Y,A37),\"0.0%\")","v":0},{"$error":"#N/A"},{"$error":"#N/A"},{"$f":"$A$80&\"\" &\" (\"&G13&\")\"","v":"Other Postsecondary Education or Training (0)"},{"$f":"$A$80&\"\" &\" (\"&S18&\")\"","v":"Other Postsecondary Education or Training (0)"},{"$f":"$A$80&\"\" &\" (\"&W26&\")\"","v":"Other Postsecondary Education or Training (0)"}]
{"$rows_left_out":96}